BDBM97003 2-[4-(diethylamino)anilino]-9,10-dimethoxy-6,7-dihydropyrimid[6,1-a]isoquinolin-4-one::2-[4-(diethylamino)anilino]-9,10-dimethoxy-6,7-dihydropyrimido[6,1-a]isoquinolin-4-one::2-[[4-(diethylamino)phenyl]amino]-9,10-dimethoxy-6,7-dihydropyrimido[6,1-a]isoquinolin-4-one::MLS001214928::SMR000543408::cid_1940391
SMILES CCN(CC)c1ccc(Nc2cc3-c4cc(OC)c(OC)cc4CCn3c(=O)n2)cc1
InChI Key InChIKey=FRBWKKDEUMLFGH-UHFFFAOYSA-N
Data  1 EC50
  Tab Delimited (TSV)   2D SDfile   Computed 3D by Vconf -m prep SDfile
Find this compound or compounds like it in BindingDB:
Activity Spreadsheet -- Enzyme Inhibition Constant Data from BindingDB
Found 1 hit for monomerid = 97003
TargetProbable global transcription activator SNF2L2(Homo sapiens (Human))
The Scripps Research Institute Molecular Screening Center
Curated by PubChem BioAssay
LigandPNGBDBM97003(2-[4-(diethylamino)anilino]-9,10-dimethoxy-6,7-dih...)
Affinity DataEC50:  9.12E+4nM
In DepthDetails PCBioAssay