BDBM97010 MLS001140889::N-methyl-N-(1-methyl-[1,2,4]triazolo[4,3-a]quinoxalin-4-yl)benzenesulfonamide::SMR000650333::cid_1854166
SMILES CN(c1nc2ccccc2n2c(C)nnc12)S(=O)(=O)c1ccccc1
InChI Key InChIKey=RXVLFKQTKSVJPE-UHFFFAOYSA-N
Data  1 EC50
  Tab Delimited (TSV)   2D SDfile   Computed 3D by Vconf -m prep SDfile
Find this compound or compounds like it in BindingDB:
Activity Spreadsheet -- Enzyme Inhibition Constant Data from BindingDB
Found 1 hit for monomerid = 97010
TargetProbable global transcription activator SNF2L2(Homo sapiens (Human))
The Scripps Research Institute Molecular Screening Center
Curated by PubChem BioAssay
LigandPNGBDBM97010(MLS001140889 | N-methyl-N-(1-methyl-[1,2,4]triazol...)
Affinity DataEC50:  9.12E+4nM
In DepthDetails PCBioAssay