BDBM97018 3,4,5,6-tetrachloro-2-pyridinecarboxylic acid [2-[(3-methoxyphenyl)methylamino]-2-oxoethyl] ester::3,4,5,6-tetrachloropicolinic acid [2-keto-2-(m-anisylamino)ethyl] ester::MLS002156535::SMR001239039::[2-[(3-methoxyphenyl)methylamino]-2-oxidanylidene-ethyl] 3,4,5,6-tetrakis(chloranyl)pyridine-2-carboxylate::[2-[(3-methoxyphenyl)methylamino]-2-oxoethyl] 3,4,5,6-tetrachloropyridine-2-carboxylate::cid_16302071
SMILES COc1cccc(CNC(=O)COC(=O)c2nc(Cl)c(Cl)c(Cl)c2Cl)c1
InChI Key InChIKey=COOYMHBLQUZDNF-UHFFFAOYSA-N
Data  1 EC50
  Tab Delimited (TSV)   2D SDfile   Computed 3D by Vconf -m prep SDfile
Find this compound or compounds like it in BindingDB:
Activity Spreadsheet -- Enzyme Inhibition Constant Data from BindingDB
Found 1 hit for monomerid = 97018
TargetProbable global transcription activator SNF2L2(Homo sapiens (Human))
The Scripps Research Institute Molecular Screening Center
Curated by PubChem BioAssay
LigandPNGBDBM97018(3,4,5,6-tetrachloro-2-pyridinecarboxylic acid [2-[...)
Affinity DataEC50:  9.12E+4nM
In DepthDetails PCBioAssay