BDBM97063 9-methoxy-4-(3-methyl-1-piperidinyl)-5H-pyrimido[5,4-b]indole::9-methoxy-4-(3-methylpiperidin-1-yl)-5H-pyrimido[5,4-b]indole::9-methoxy-4-(3-methylpiperidino)-5H-pyrimid[5,4-b]indole::MLS000040609::SMR000044316::cid_663629
SMILES COc1cccc2[nH]c3c(ncnc3c12)N1CCCC(C)C1
InChI Key InChIKey=AIJBVQPEQXKJFG-UHFFFAOYSA-N
Data  1 IC50
  Tab Delimited (TSV)   2D SDfile   Computed 3D by Vconf -m prep SDfile
Find this compound or compounds like it in BindingDB:
Activity Spreadsheet -- Enzyme Inhibition Constant Data from BindingDB
Found 1 hit for monomerid = 97063
TargetGalanin receptor type 3(Homo sapiens (Human))
The Scripps Research Institute Molecular Screening Center
Curated by PubChem BioAssay
LigandPNGBDBM97063(9-methoxy-4-(3-methyl-1-piperidinyl)-5H-pyrimido[5...)
Affinity DataIC50:  400nM
In DepthDetails PCBioAssay