BDBM9713 2-methylpropyl N-[(2S)-1-[(2S)-2-({1-[({[(1S)-1-carbamoyl-3-methylbutyl]carbamoyl}methyl)carbamoyl]-1-oxopentan-2-yl}carbamoyl)pyrrolidin-1-yl]-3-methyl-1-oxobutan-2-yl]carbamate::P3-capped alpha-ketoamide inhibitor 28
SMILES CCCC(NC(=O)[C@@H]1CCCN1C(=O)[C@@H](NC(=O)OCC(C)C)C(C)C)C(=O)C(=O)NCC(=O)N[C@@H](CC(C)C)C(N)=O
InChI Key InChIKey=GWYOCLYFZNGOOY-AZJXCBEJSA-N
Data  1 KI
  Tab Delimited (TSV)   2D SDfile   Computed 3D by Vconf -m prep SDfile
Find this compound or compounds like it in BindingDB:
Activity Spreadsheet -- Enzyme Inhibition Constant Data from BindingDB
Found 1 hit for monomerid = 9713
TargetGenome polyprotein(Hepatitis C virus (HCV genotype 1a, isolate H))
Schering-Plough Research Institute
LigandPNGBDBM9713(2-methylpropyl N-[(2S)-1-[(2S)-2-({1-[({[(1S)-1-ca...)
Affinity DataKi:  1.60E+4nM ΔG°:  -6.65kcal/molepH: 6.5 T: 2°C. Assay description: Proteolytic cleavage of the ester linkage between the Nva (L-norvaline) and the chromophore (PAP) was monitored for change in absorbance at 370 nm. I...
In DepthDetails ArticlePubMed