BDBM97182 3-(4-methoxy-2-methyl-phenyl)-N-veratryl-benzofuran-7-carboxamide::MLS003120612::N-[(3,4-dimethoxyphenyl)methyl]-3-(4-methoxy-2-methyl-phenyl)-1-benzofuran-7-carboxamide::N-[(3,4-dimethoxyphenyl)methyl]-3-(4-methoxy-2-methylphenyl)-1-benzofuran-7-carboxamide::N-[(3,4-dimethoxyphenyl)methyl]-3-(4-methoxy-2-methylphenyl)-7-benzofurancarboxamide::SMR001289998::cid_46943517
SMILES COc1ccc(-c2coc3c(cccc23)C(=O)NCc2ccc(OC)c(OC)c2)c(C)c1
InChI Key InChIKey=RAWZOGBOBSTINK-UHFFFAOYSA-N
Data  1 IC50
  Tab Delimited (TSV)   2D SDfile   Computed 3D by Vconf -m prep SDfile
Find this compound or compounds like it in BindingDB:
Activity Spreadsheet -- Enzyme Inhibition Constant Data from BindingDB
Found 1 hit for monomerid = 97182
TargetGalanin receptor type 3(Homo sapiens (Human))
The Scripps Research Institute Molecular Screening Center
Curated by PubChem BioAssay
LigandPNGBDBM97182(3-(4-methoxy-2-methyl-phenyl)-N-veratryl-benzofura...)
Affinity DataIC50:  358nM
Ligand InfoPC cidPC sid
In DepthDetails PCBioAssay