BDBM9723 (2S)-2-(2-{3-[(2S)-2-[(2S)-2-cyclohexyl-2-{[(2-methylpropoxy)carbonyl]amino}acetamido]-4-methylpentanamido]-2-oxohexanamido}acetamido)-2-(piperidin-4-yl)acetic acid::P3-capped alpha-ketoamide inhibitor 39
SMILES CCCC(NC(=O)[C@H](CC(C)C)NC(=O)[C@@H](NC(=O)OCC(C)C)C1CCCCC1)C(=O)C(=O)NCC(=O)N[C@@H](C1CCNCC1)C(O)=O
InChI Key InChIKey=POPPWPDOLPQWGI-ILXHYJSTSA-N
Data  1 KI
  Tab Delimited (TSV)   2D SDfile   Computed 3D by Vconf -m prep SDfile
Find this compound or compounds like it in BindingDB:
Activity Spreadsheet -- Enzyme Inhibition Constant Data from BindingDB
Found 1 hit for monomerid = 9723
TargetGenome polyprotein(Hepatitis C virus (HCV genotype 1a, isolate H))
Schering-Plough Research Institute
LigandPNGBDBM9723((2S)-2-(2-{3-[(2S)-2-[(2S)-2-cyclohexyl-2-{[(2-met...)
Affinity DataKi:  6.40E+3nM. Assay description: Proteolytic cleavage of the ester linkage between the Nva (L-norvaline) and the chromophore (PAP) was monitored for change in absorbance at 370 nm. I...
In DepthDetails ArticlePubMed