BDBM97234 MLS001167414::N-(4,6-dimethyl-1,3-benzothiazol-2-yl)-2-furamide::N-(4,6-dimethyl-1,3-benzothiazol-2-yl)-2-furancarboxamide::N-(4,6-dimethyl-1,3-benzothiazol-2-yl)furan-2-carboxamide::SMR000640703::cid_702340
SMILES Cc1cc(C)c2nc(NC(=O)c3ccco3)sc2c1
InChI Key InChIKey=QDNFWKWRSIUGLJ-UHFFFAOYSA-N
Data  2 IC50
  Tab Delimited (TSV)   2D SDfile   Computed 3D by Vconf -m prep SDfile
Find this compound or compounds like it in BindingDB:
Activity Spreadsheet -- Enzyme Inhibition Constant Data from BindingDB
Found 2 hits for monomerid = 97234
TargetSteroidogenic factor 1(Homo sapiens (Human))
The Scripps Research Institute Molecular Screening Center
Curated by PubChem BioAssay
LigandPNGBDBM97234(MLS001167414 | N-(4,6-dimethyl-1,3-benzothiazol-2-...)
Affinity DataIC50: >6.75E+4nM
In DepthDetails PCBioAssay
TargetNuclear receptor subfamily 0 group B member 1(Homo sapiens (Human))
The Scripps Research Institute Molecular Screening Center
Curated by PubChem BioAssay
LigandPNGBDBM97234(MLS001167414 | N-(4,6-dimethyl-1,3-benzothiazol-2-...)
Affinity DataIC50: >278nM
In DepthDetails PCBioAssay