BDBM97374 Orexin receptor antagonist 4::US20130102619, 4
SMILES C[C@@H]1CC[C@H](CN1C(=O)c1c(C)cccc1-n1nccn1)Oc1cc(ccn1)C#N
InChI Key InChIKey=GQCLNKPNLVDVKR-SJLPKXTDSA-N
Data  2 KI  2 IC50
  Tab Delimited (TSV)   2D SDfile   Computed 3D by Vconf -m prep SDfile
Find this compound or compounds like it in BindingDB:
Activity Spreadsheet -- Enzyme Inhibition Constant Data from BindingDB
Found 4 hits for monomerid = 97374
TargetOrexin receptor type 2(Homo sapiens (Human))
TBA
US Patent
LigandPNGBDBM97374(Orexin receptor antagonist 4 | US20130102619, 4)
Affinity DataKi:  2.30nM. Assay description: The inhibition constant (ki) is determined using a radioligand assay.
In DepthDetails US Patent
TargetOrexin/Hypocretin receptor type 1(Homo sapiens (Human))
TBA
US Patent
LigandPNGBDBM97374(Orexin receptor antagonist 4 | US20130102619, 4)
Affinity DataKi:  932nM. Assay description: The inhibition constant (ki) is determined using a radioligand assay.
In DepthDetails US Patent
TargetOrexin receptor type 2(Rattus norvegicus (Rat))
TBA
US Patent
LigandPNGBDBM97374(Orexin receptor antagonist 4 | US20130102619, 4)
Affinity DataIC50:  29nMT: 2°C. Assay description: FLIPR assay using orexin receptor.
In DepthDetails US Patent
TargetOrexin/Hypocretin receptor type 1(Rattus norvegicus (Rat))
TBA
US Patent
LigandPNGBDBM97374(Orexin receptor antagonist 4 | US20130102619, 4)
Affinity DataIC50: >1.00E+4nMT: 2°C. Assay description: FLIPR assay using orexin receptor.
In DepthDetails US Patent