BDBM97417 Phenylaminoacetic acid benzylidene hydrazine analog, 10
SMILES Oc1ccccc1\C=N\NC(=O)CNc1ccccc1
InChI Key InChIKey=MJUMZJXENXJDKV-LICLKQGHSA-N
Data  1 IC50
  Tab Delimited (TSV)   2D SDfile   Computed 3D by Vconf -m prep SDfile
Find this compound or compounds like it in BindingDB:
Activity Spreadsheet -- Enzyme Inhibition Constant Data from BindingDB
Found 1 hit for monomerid = 97417
TargetEnoyl-acyl carrier reductase(Plasmodium falciparum)
Bombay College Of Pharmacy
LigandPNGBDBM97417(Phenylaminoacetic acid benzylidene hydrazine analo...)
Affinity DataIC50: >1.85E+5nMpH: 7.4Assay Description:Inhibition assay using pfENR.
In DepthDetails ArticlePubMed