BDBM97419 Phenylaminoacetic acid benzylidene hydrazine analog, 12
SMILES Oc1ccccc1\C=N\NC(=O)CNc1cccc(F)c1Cl
InChI Key InChIKey=QMVXCAQNBOXQBG-UFWORHAWSA-N
Data  1 IC50
  Tab Delimited (TSV)   2D SDfile   Computed 3D by Vconf -m prep SDfile
Find this compound or compounds like it in BindingDB:
Activity Spreadsheet -- Enzyme Inhibition Constant Data from BindingDB
Found 1 hit for monomerid = 97419
TargetEnoyl-acyl carrier reductase(Plasmodium falciparum)
Bombay College Of Pharmacy
LigandPNGBDBM97419(Phenylaminoacetic acid benzylidene hydrazine analo...)
Affinity DataIC50: >1.55E+5nMpH: 7.4Assay Description:Inhibition assay using pfENR.
In DepthDetails ArticlePubMed