BDBM97422 Phenylaminoacetic acid benzylidene hydrazine analog, 15
SMILES Fc1cccc(NCC(=O)N\N=C\c2cccc(Br)c2)c1Cl
InChI Key InChIKey=PLLUKMFYKKOATE-DNTJNYDQSA-N
Data  1 IC50
  Tab Delimited (TSV)   2D SDfile   Computed 3D by Vconf -m prep SDfile
Find this compound or compounds like it in BindingDB:
Activity Spreadsheet -- Enzyme Inhibition Constant Data from BindingDB
Found 1 hit for monomerid = 97422
TargetEnoyl-acyl carrier reductase(Plasmodium falciparum)
Bombay College Of Pharmacy
LigandPNGBDBM97422(Phenylaminoacetic acid benzylidene hydrazine analo...)
Affinity DataIC50: >1.29E+5nMpH: 7.4Assay Description:Inhibition assay using pfENR.
In DepthDetails ArticlePubMed