BDBM97480 US8470816, 252
SMILES COc1ccc(cc1)C(=O)N(C)[C@@H]1CCN(C[C@H]1c1ccc(Cl)c(Cl)c1)C(=O)C1CCN(CC1)C(C)=O
InChI Key InChIKey=OAVNGCZBHRXUGH-JYFHCDHNSA-N
Data  2 IC50
  Tab Delimited (TSV)   2D SDfile   Computed 3D by Vconf -m prep SDfile
Find this compound or compounds like it in BindingDB:
Activity Spreadsheet -- Enzyme Inhibition Constant Data from BindingDB
Found 2 hits for monomerid = 97480
TargetSubstance-K receptor(Homo sapiens (Human))
Takeda Pharmaceutical
US Patent
LigandPNGBDBM97480(US8470816, 252)
Affinity DataIC50:  0.560nMpH: 7.5Assay Description:Radioligan receptor binding inhibitory activity using membrane fraction of CHO cell expressing human NK receptors.
In DepthDetails US Patent
TargetSubstance-P receptor(Homo sapiens (Human))
Takeda Pharmaceutical
US Patent
LigandPNGBDBM97480(US8470816, 252)
Affinity DataIC50:  250nMpH: 7.4Assay Description:Radioligan receptor binding inhibitory activity using membrane fraction of CHO cell expressing human NK receptors.
In DepthDetails US Patent