BDBM97834 US8481536, 365
SMILES Cc1cccc(C)c1-c1cc(C)c2nc(Nc3ccc(OCCN4CCOCC4)cc3)nnc2c1
InChI Key InChIKey=GDXOCCAFHXBCKZ-UHFFFAOYSA-N
Data  1 IC50
  Tab Delimited (TSV)   2D SDfile   Computed 3D by Vconf -m prep SDfile
Find this compound or compounds like it in BindingDB:
Activity Spreadsheet -- Enzyme Inhibition Constant Data from BindingDB
Found 1 hit for monomerid = 97834
TargetProto-oncogene tyrosine-protein kinase Src(Homo sapiens (Human))
Targegen
US Patent
LigandPNGBDBM97834(US8481536, 365)
Affinity DataIC50:  32.9nMT: 2°C. Assay description: Testing of inhibition of kinases in vitro using luciferase-based assay from KinaseGlo, Promega Corp.
In DepthDetails US Patent