BDBM97847 US8481536, 391
SMILES CN1CCN(CCCOc2ccc(Nc3nnc4cc(cc(C)c4n3)-c3c(Cl)cccc3Cl)cc2)CC1
InChI Key InChIKey=BZRIMEVGBJNZTO-UHFFFAOYSA-N
Data  1 IC50
  Tab Delimited (TSV)   2D SDfile   Computed 3D by Vconf -m prep SDfile
Find this compound or compounds like it in BindingDB:
Activity Spreadsheet -- Enzyme Inhibition Constant Data from BindingDB
Found 1 hit for monomerid = 97847
TargetProto-oncogene tyrosine-protein kinase Src(Homo sapiens (Human))
Targegen
US Patent
LigandPNGBDBM97847(US8481536, 391)
Affinity DataIC50:  25.2nMT: 2°C. Assay description: Testing of inhibition of kinases in vitro using luciferase-based assay from KinaseGlo, Promega Corp.
In DepthDetails US Patent