BDBM97863 US8481536, 411::US8481536, 589
SMILES Cc1cccc(C)c1-c1cc(C)c2nc(Nc3nc(cs3)C(=O)NCCN3CCCC3)nnc2c1
InChI Key InChIKey=BOQLSYBMPFBUNE-UHFFFAOYSA-N
Data  4 IC50
  Tab Delimited (TSV)   2D SDfile   Computed 3D by Vconf -m prep SDfile
Find this compound or compounds like it in BindingDB:
Activity Spreadsheet -- Enzyme Inhibition Constant Data from BindingDB
Found 4 hits for monomerid = 97863
TargetProto-oncogene tyrosine-protein kinase Src(Homo sapiens (Human))
Targegen
US Patent
LigandPNGBDBM97863(US8481536, 411 | US8481536, 589)
Affinity DataIC50:  14.6nMT: 2°C. Assay description: Testing of inhibition of kinases in vitro using luciferase-based assay from KinaseGlo, Promega Corp.
In DepthDetails US Patent
TargetEphrin type-B receptor 4(Homo sapiens (Human))
Targegen
US Patent
LigandPNGBDBM97863(US8481536, 411 | US8481536, 589)
Affinity DataIC50:  66.1nMT: 2°C. Assay description: Testing of inhibition of kinases in vitro using luciferase-based assay from KinaseGlo, Promega Corp.
In DepthDetails US Patent
TargetPlatelet-derived growth factor receptor beta(Homo sapiens (Human))
Targegen
US Patent
LigandPNGBDBM97863(US8481536, 411 | US8481536, 589)
Affinity DataIC50:  60nM. Assay description: Testing of inhibition of kinases in vitro using luciferase-based assay from KinaseGlo, Promega Corp.
In DepthDetails US Patent
TargetTyrosine-protein kinase Yes(Homo sapiens (Human))
Targegen
US Patent
LigandPNGBDBM97863(US8481536, 411 | US8481536, 589)
Affinity DataIC50:  7.30nMT: 2°C. Assay description: Testing of inhibition of kinases in vitro using luciferase-based assay from KinaseGlo, Promega Corp.
In DepthDetails US Patent