BDBM98032 US8486953, 2
SMILES CCOc1cc(ccc1Nc1ncnc2sc(C(N)=O)c(C)c12)C(N)=O
InChI Key InChIKey=DGUSKGFGXIHXKS-UHFFFAOYSA-N
Data  2 IC50
  Tab Delimited (TSV)   2D SDfile   Computed 3D by Vconf -m prep SDfile
Find this compound or compounds like it in BindingDB:
Activity Spreadsheet -- Enzyme Inhibition Constant Data from BindingDB
Found 2 hits for monomerid = 98032
TargetMAP kinase-interacting serine/threonine-protein kinase 2(Homo sapiens (Human))
Boehringer Ingelheim International
US Patent
LigandPNGBDBM98032(US8486953, 2)
Affinity DataIC50:  28nMpH: 7.4Assay Description:In vitro kinase assay using human Mnk1 and Mnk2.
In DepthDetails US Patent
TargetMAP kinase-interacting serine/threonine-protein kinase 1(Homo sapiens (Human))
Boehringer Ingelheim International
US Patent
LigandPNGBDBM98032(US8486953, 2)
Affinity DataIC50:  120nMpH: 7.4Assay Description:In vitro kinase assay using human Mnk1 and Mnk2.
In DepthDetails US Patent