BDBM98037 US8486953, 34
SMILES CN(C)CCCNC(=O)c1sc2ncnc(Nc3ccc(nc3OC3CCOCC3)C(F)(F)F)c2c1C
InChI Key InChIKey=IEPPUFLBHOABDC-UHFFFAOYSA-N
Data  2 IC50
  Tab Delimited (TSV)   2D SDfile   Computed 3D by Vconf -m prep SDfile
Find this compound or compounds like it in BindingDB:
Activity Spreadsheet -- Enzyme Inhibition Constant Data from BindingDB
Found 2 hits for monomerid = 98037
TargetMAP kinase-interacting serine/threonine-protein kinase 2(Homo sapiens (Human))
Boehringer Ingelheim International
US Patent
LigandPNGBDBM98037(US8486953, 34)
Affinity DataIC50:  560nMpH: 7.4Assay Description:In vitro kinase assay using human Mnk1 and Mnk2.
In DepthDetails US Patent
TargetMAP kinase-interacting serine/threonine-protein kinase 1(Homo sapiens (Human))
Boehringer Ingelheim International
US Patent
LigandPNGBDBM98037(US8486953, 34)
Affinity DataIC50:  680nMpH: 7.4Assay Description:In vitro kinase assay using human Mnk1 and Mnk2.
In DepthDetails US Patent