BDBM98055 (2S)-2-amino-2-cyclohexyl-N-(1-diphenoxyphosphorylethyl)acetamide::Compound 9.5
SMILES CC(NC(=O)[C@@H](N)C1CCCCC1)P(=O)(Oc1ccccc1)Oc1ccccc1
InChI Key InChIKey=LUNUTDXQTSGSJG-LFABVHOISA-N
Data  2 IC50
  Tab Delimited (TSV)   2D SDfile   Computed 3D by Vconf -m prep SDfile
Find this compound or compounds like it in BindingDB:
Activity Spreadsheet -- Enzyme Inhibition Constant Data from BindingDB
Found 2 hits for monomerid = 98055
TargetDipeptidyl peptidase 2(Homo sapiens (Human))
University Of Anterwerp
LigandPNGBDBM98055((2S)-2-amino-2-cyclohexyl-N-(1-diphenoxyphosphoryl...)
Affinity DataIC50: >1.00E+6nMpH: 5.5 T: 2°C. Assay description: Inhibitory concentration of the compound against Dipeptidyl peptidase IV (DPP IV) in Homo sapiens (human)is measured
In DepthDetails ArticlePubMed
TargetDipeptidyl peptidase 4(Homo sapiens (Human))
University Of Anterwerp
LigandPNGBDBM98055((2S)-2-amino-2-cyclohexyl-N-(1-diphenoxyphosphoryl...)
Affinity DataIC50: >1.00E+6nMpH: 8.3 T: 2°C. Assay description: Inhibitory concentration of the compound against Dipeptidyl peptidase IV (DPP IV) in Homo sapiens (human)is measured
In DepthDetails ArticlePubMed