BDBM98091 1-[4-[(3,4-dichlorophenyl)sulfonylamino]phenyl]-3-(2-nitrophenyl)urea::Compound ID 5{3}
SMILES [O-][N+](=O)c1ccccc1NC(=O)Nc1ccc(NS(=O)(=O)c2ccc(Cl)c(Cl)c2)cc1
InChI Key InChIKey=QDEXODTWCGUQHX-UHFFFAOYSA-N
Data  2 IC50
  Tab Delimited (TSV)   2D SDfile   Computed 3D by Vconf -m prep SDfile
Find this compound or compounds like it in BindingDB:
Activity Spreadsheet -- Enzyme Inhibition Constant Data from BindingDB
Found 2 hits for monomerid = 98091
TargetProbable nicotinate-nucleotide adenylyltransferase(Bacillus anthracis)
University Of Alabama At Birmingham
LigandPNGBDBM98091(1-[4-[(3,4-dichlorophenyl)sulfonylamino]phenyl]-3-...)
Affinity DataIC50: >6.00E+5nMpH: 7.5 T: 2°C. Assay description: Inhibitory concentration of the compound measured against B. anthracis Nicotinic acid mononucleotide adenylyltransferase (NaMNAT)using HPLC Enzyme As...
In DepthDetails ArticlePubMed
TargetNH(3)-dependent NAD(+) synthetase(Bacillus anthracis)
University Of Alabama At Birmingham
LigandPNGBDBM98091(1-[4-[(3,4-dichlorophenyl)sulfonylamino]phenyl]-3-...)
Affinity DataIC50:  4.43E+5nMpH: 8.5 T: 2°C. Assay description: Inhibitory concentration of the compound measured against B. anthracis Nicotinamide adenine dinucleotide synthetase (NADs) using HPLC Enzyme Assay
In DepthDetails ArticlePubMed