BDBM98108 1-[4-[(3-fluorophenyl)sulfonylamino]phenyl]-3-(3-nitrophenyl)urea::Compound ID 7{2,6}
SMILES [O-][N+](=O)c1cccc(NC(=O)Nc2ccc(NS(=O)(=O)c3cccc(F)c3)cc2)c1
InChI Key InChIKey=JYFAOIMZVYRMAY-UHFFFAOYSA-N
Data  2 IC50
  Tab Delimited (TSV)   2D SDfile   Computed 3D by Vconf -m prep SDfile
Find this compound or compounds like it in BindingDB:
Activity Spreadsheet -- Enzyme Inhibition Constant Data from BindingDB
Found 2 hits for monomerid = 98108
TargetProbable nicotinate-nucleotide adenylyltransferase(Bacillus anthracis)
University Of Alabama At Birmingham
LigandPNGBDBM98108(1-[4-[(3-fluorophenyl)sulfonylamino]phenyl]-3-(3-n...)
Affinity DataIC50: >1.50E+5nMpH: 7.5 T: 2°C. Assay description: Inhibitory concentration of the compound measured against B. anthracis Nicotinic acid mononucleotide adenylyltransferase (NaMNAT)using HPLC Enzyme As...
In DepthDetails ArticlePubMed
TargetNH(3)-dependent NAD(+) synthetase(Bacillus anthracis)
University Of Alabama At Birmingham
LigandPNGBDBM98108(1-[4-[(3-fluorophenyl)sulfonylamino]phenyl]-3-(3-n...)
Affinity DataIC50:  5.35E+5nMpH: 8.5 T: 2°C. Assay description: Inhibitory concentration of the compound measured against B. anthracis Nicotinamide adenine dinucleotide synthetase (NADs) using HPLC Enzyme Assay
In DepthDetails ArticlePubMed