BDBM98162 1-[4-[[4-(aminomethyl)phenyl]sulfonylamino]phenyl]-3-(3-nitrophenyl)urea::Compound ID 8{2,20}
SMILES NCc1ccc(cc1)S(=O)(=O)Nc1ccc(NC(=O)Nc2cccc(c2)[N+]([O-])=O)cc1
InChI Key InChIKey=GHBDWRYJFOPLCY-UHFFFAOYSA-N
Data  2 IC50
  Tab Delimited (TSV)   2D SDfile   Computed 3D by Vconf -m prep SDfile
Find this compound or compounds like it in BindingDB:
Activity Spreadsheet -- Enzyme Inhibition Constant Data from BindingDB
Found 2 hits for monomerid = 98162
TargetProbable nicotinate-nucleotide adenylyltransferase(Bacillus anthracis)
University Of Alabama At Birmingham
LigandPNGBDBM98162(1-[4-[[4-(aminomethyl)phenyl]sulfonylamino]phenyl]...)
Affinity DataIC50:  5.12E+4nMpH: 7.5 T: 2°C. Assay description: Inhibitory concentration of the compound measured against B. anthracis Nicotinic acid mononucleotide adenylyltransferase (NaMNAT)using HPLC Enzyme As...
In DepthDetails ArticlePubMed
TargetNH(3)-dependent NAD(+) synthetase(Bacillus anthracis)
University Of Alabama At Birmingham
LigandPNGBDBM98162(1-[4-[[4-(aminomethyl)phenyl]sulfonylamino]phenyl]...)
Affinity DataIC50:  1.53E+4nMpH: 8.5 T: 2°C. Assay description: Inhibitory concentration of the compound measured against B. anthracis Nicotinamide adenine dinucleotide synthetase (NADs) using HPLC Enzyme Assay
In DepthDetails ArticlePubMed