BDBM98191 US8481733, 2
SMILES Nc1nccn2c(nc(-c3ccc(Oc4ccccc4)cc3)c12)C1CC1
InChI Key InChIKey=LUFUPMBJKOICQM-UHFFFAOYSA-N
Data  1 IC50
  Tab Delimited (TSV)   2D SDfile   Computed 3D by Vconf -m prep SDfile
Find this compound or compounds like it in BindingDB:
Activity Spreadsheet -- Enzyme Inhibition Constant Data from BindingDB
Found 1 hit for monomerid = 98191
TargetActivated CDC42 kinase 1(Homo sapiens (Human))
Osi Pharmaceuticals
US Patent
LigandPNGBDBM98191(US8481733, 2)
Affinity DataIC50:  271nM. Assay description: AlphaScreen (amplified luminescent proximity homogeneous assay) assay was used to test for ACK1 inhibitory activity.
In DepthDetails US Patent