BDBM98450 US8481733, 262
SMILES C[C@@]1(O)C[C@@H](C1)c1nc(-c2ccc(C(=O)c3ccccc3)c(N)c2)c2c(N)nccn12
InChI Key InChIKey=URKDEQMCPCDLNE-ONEIWYMKSA-N
Data  1 IC50
  Tab Delimited (TSV)   2D SDfile   Computed 3D by Vconf -m prep SDfile
Find this compound or compounds like it in BindingDB:
Activity Spreadsheet -- Enzyme Inhibition Constant Data from BindingDB
Found 1 hit for monomerid = 98450
TargetActivated CDC42 kinase 1(Homo sapiens (Human))
Osi Pharmaceuticals
US Patent
LigandPNGBDBM98450(US8481733, 262)
Affinity DataIC50:  50nM. Assay description: AlphaScreen (amplified luminescent proximity homogeneous assay) assay was used to test for ACK1 inhibitory activity.
In DepthDetails US Patent