BDBM98580 4-[[(1R)-2-[[2-[(4-carbamimidoylphenyl)methylamino]-2-oxo-ethyl]amino]-1-(hydroxymethyl)-2-oxo-ethyl]sulfamoylmethyl]benzoic acid::US8476306, 6.5
SMILES NC(=N)c1ccc(CNC(=O)CNC(=O)[C@@H](CO)NS(=O)(=O)Cc2ccc(cc2)C(O)=O)cc1
InChI Key InChIKey=SWRWEBCZNDCUHE-QGZVFWFLSA-N
Data  4 KI
  Tab Delimited (TSV)   2D SDfile   Computed 3D by Vconf -m prep SDfile
Find this compound or compounds like it in BindingDB:
Activity Spreadsheet -- Enzyme Inhibition Constant Data from BindingDB
Found 4 hits for monomerid = 98580
TargetUrokinase plasminogen activator surface receptor(Rattus norvegicus)
The Medicines
US Patent
LigandPNGBDBM98580(4-[[(1R)-2-[[2-[(4-carbamimidoylphenyl)methylamino...)
Affinity DataKi:  150nM ΔG°:  -9.27kcal/moleT: 2°C. Assay description: Inhibition constant of the compound against Plasminogen activator urokinase
In DepthDetails US Patent
TargetSerine protease 1(Rattus norvegicus)
The Medicines
US Patent
LigandPNGBDBM98580(4-[[(1R)-2-[[2-[(4-carbamimidoylphenyl)methylamino...)
Affinity DataKi:  480nM ΔG°:  -8.59kcal/moleT: 2°C. Assay description: Inhibition constant of the compound against Trypsin
In DepthDetails US Patent
TargetPlasminogen(Rattus norvegicus)
The Medicines
US Patent
LigandPNGBDBM98580(4-[[(1R)-2-[[2-[(4-carbamimidoylphenyl)methylamino...)
Affinity DataKi:  3.50E+4nM ΔG°:  -6.05kcal/moleT: 2°C. Assay description: Inhibition constant of the compound against Plasmin
In DepthDetails US Patent
TargetProthrombin(Rattus norvegicus)
The Medicines
US Patent
LigandPNGBDBM98580(4-[[(1R)-2-[[2-[(4-carbamimidoylphenyl)methylamino...)
Affinity DataKi:  1.70E+5nM ΔG°:  -5.12kcal/moleT: 2°C. Assay description: Inhibition constant of the compound against Thrombin
In DepthDetails US Patent