BDBM98581 US8476306, 6.6::methyl 2-[[(1R)-2-[[2-[(4-carbamimidoylphenyl)methylamino]-2-oxo-ethyl]amino]-1-(hydroxymethyl)-2-oxo-ethyl]sulfamoylmethyl]benzoate
SMILES COC(=O)c1ccccc1CS(=O)(=O)N[C@H](CO)C(=O)NCC(=O)NCc1ccc(cc1)C(N)=N
InChI Key InChIKey=CFTOBJMSXPABSM-GOSISDBHSA-N
Data  4 KI
  Tab Delimited (TSV)   2D SDfile   Computed 3D by Vconf -m prep SDfile
Find this compound or compounds like it in BindingDB:
Activity Spreadsheet -- Enzyme Inhibition Constant Data from BindingDB
Found 4 hits for monomerid = 98581
TargetUrokinase plasminogen activator surface receptor(Rattus norvegicus)
The Medicines
US Patent
LigandPNGBDBM98581(US8476306, 6.6 | methyl 2-[[(1R)-2-[[2-[(4-carbami...)
Affinity DataKi:  83nM ΔG°:  -9.62kcal/moleT: 2°C. Assay description: Inhibition constant of the compound against Plasminogen activator urokinase
In DepthDetails US Patent
TargetSerine protease 1(Rattus norvegicus)
The Medicines
US Patent
LigandPNGBDBM98581(US8476306, 6.6 | methyl 2-[[(1R)-2-[[2-[(4-carbami...)
Affinity DataKi:  400nM ΔG°:  -8.69kcal/moleT: 2°C. Assay description: Inhibition constant of the compound against Trypsin
In DepthDetails US Patent
TargetProthrombin(Rattus norvegicus)
The Medicines
US Patent
LigandPNGBDBM98581(US8476306, 6.6 | methyl 2-[[(1R)-2-[[2-[(4-carbami...)
Affinity DataKi:  4.00E+3nM ΔG°:  -7.33kcal/moleT: 2°C. Assay description: Inhibition constant of the compound against Thrombin
In DepthDetails US Patent
TargetPlasminogen(Rattus norvegicus)
The Medicines
US Patent
LigandPNGBDBM98581(US8476306, 6.6 | methyl 2-[[(1R)-2-[[2-[(4-carbami...)
Affinity DataKi:  3.80E+4nM ΔG°:  -6.01kcal/moleT: 2°C. Assay description: Inhibition constant of the compound against Plasmin
In DepthDetails US Patent