BDBM98617 2-amino-1-ethyl-7-(3-hydroxy-4-methoxy-3-methyl-but-1-ynyl)-N-methyl-4-oxo-1,8-naphthyridine-3-carboxamide::US8470847, 72
SMILES CCn1c(N)c(C(=O)NC)c(=O)c2ccc(nc12)C#CC(C)(O)COC
InChI Key InChIKey=PFMPOBVAYMTUOX-UHFFFAOYSA-N
Data  1 IC50
  Tab Delimited (TSV)   2D SDfile   Computed 3D by Vconf -m prep SDfile
Find this compound or compounds like it in BindingDB:
Activity Spreadsheet -- Enzyme Inhibition Constant Data from BindingDB
Found 1 hit for monomerid = 98617
TargetVascular endothelial growth factor receptor 3(Homo sapiens (Human))
Sanofi
US Patent
LigandPNGBDBM98617(2-amino-1-ethyl-7-(3-hydroxy-4-methoxy-3-methyl-bu...)
Affinity DataIC50:  23nMT: 2°C. Assay description: Activity of VEGFR-3 is measured by ELISA assay by measuring the intensity of phosphorylation of the substrate poly Glu-Tyr.
In DepthDetails US Patent