BDBM98646 US8497376, 22
SMILES CC1(C)CCC(=CC1)c1cc(ccc1NC(=O)c1ncc([nH]1)C#N)C1CC(C)(C)S(=O)(=O)C(C)(C)C1
InChI Key InChIKey=IJHJSHFKVNEYSN-UHFFFAOYSA-N
Data  1 IC50
  Tab Delimited (TSV)   2D SDfile   Computed 3D by Vconf -m prep SDfile
Find this compound or compounds like it in BindingDB:
Activity Spreadsheet -- Enzyme Inhibition Constant Data from BindingDB
Found 1 hit for monomerid = 98646
TargetMacrophage colony-stimulating factor 1 receptor(Mus musculus (Mouse))
Janssen Pharmaceutica
US Patent
LigandPNGBDBM98646(US8497376, 22)
Affinity DataIC50:  2nMpH: 7.5Assay Description:An autophosphorylation, fluroescence polarization competition immunoassay was used to determine the potency for c-fms inhibition.
In DepthDetails US Patent