BDBM98739 US8487093, 86
SMILES OS(=O)(=O)ON1[C@H]2CN([C@@H](CC2)C(=O)N[C@@H]2CCNC[C@@H]2F)C1=O
InChI Key InChIKey=BFXWSEXOZZPNPH-RGOKHQFPSA-N
Data  2 IC50
  Tab Delimited (TSV)   2D SDfile   Computed 3D by Vconf -m prep SDfile
Find this compound or compounds like it in BindingDB:
Activity Spreadsheet -- Enzyme Inhibition Constant Data from BindingDB
Found 2 hits for monomerid = 98739
TargetBeta-lactamase(Pseudomonas aeruginosa)
Merck Sharp & Dohme
US Patent
LigandPNGBDBM98739(US8487093, 86)
Affinity DataIC50:  20nM. Assay description: Enzyme activities were measured in the presence of the test inhibitor in spectrophotometric assay.
In DepthDetails US Patent
TargetBeta-lactamase(Klebsiella pneumoniae)
Merck Sharp & Dohme
US Patent
LigandPNGBDBM98739(US8487093, 86)
Affinity DataIC50:  270nM. Assay description: Enzyme activities were measured in the presence of the test inhibitor in spectrophotometric assay.
In DepthDetails US Patent