BDBM98823 US8487093, 220
SMILES OS(=O)(=O)ON1[C@H]2CN([C@@H](CC2)C(=O)O[C@@H]2CCCNCC2)C1=O
InChI Key InChIKey=CMLANUUNCPVPDC-MXWKQRLJSA-N
Data  2 IC50
  Tab Delimited (TSV)   2D SDfile   Computed 3D by Vconf -m prep SDfile
Find this compound or compounds like it in BindingDB:
Activity Spreadsheet -- Enzyme Inhibition Constant Data from BindingDB
Found 2 hits for monomerid = 98823
TargetBeta-lactamase(Pseudomonas aeruginosa)
Merck Sharp & Dohme
US Patent
LigandPNGBDBM98823(US8487093, 220)
Affinity DataIC50:  3.30E+4nM. Assay description: Enzyme activities were measured in the presence of the test inhibitor in spectrophotometric assay.
In DepthDetails US Patent
TargetBeta-lactamase(Klebsiella pneumoniae)
Merck Sharp & Dohme
US Patent
LigandPNGBDBM98823(US8487093, 220)
Affinity DataIC50:  6.40E+3nM. Assay description: Enzyme activities were measured in the presence of the test inhibitor in spectrophotometric assay.
In DepthDetails US Patent