BDBM98933 US8497265, 345
SMILES OCC1CCN(CC1)c1cnccc1OC1CN(C1)c1ccc2ccccc2n1
InChI Key InChIKey=GTDZZKHHEBNCLB-UHFFFAOYSA-N
Data  12 IC50
  Tab Delimited (TSV)   2D SDfile   Computed 3D by Vconf -m prep SDfile
Find this compound or compounds like it in BindingDB:
Activity Spreadsheet -- Enzyme Inhibition Constant Data from BindingDB
Found 12 hits for monomerid = 98933
TargetcAMP and cAMP-inhibited cGMP 3',5'-cyclic phosphodiesterase 10A(Rattus norvegicus (rat))
Amgen
US Patent
LigandPNGBDBM98933(US8497265, 345)
Affinity DataIC50:  7.08nM. Assay description: Enzyme activity: An IMAP TR-FRET assay was used to analyze the enzyme activity (Molecular Devices Corp., Sunnyvale, Calif).
In DepthDetails US Patent
LigandPNGBDBM98933(US8497265, 345)
Affinity DataIC50:  4.70E+3nM. Assay description: Inhibition of human PDE10A using FAM-cAMP substrate by TR-FRET progressive binding assay
In DepthDetails ArticlePubMed
LigandPNGBDBM98933(US8497265, 345)
Affinity DataIC50:  4.70nM. Assay description: Inhibition of human PDE10A2 using FAM-cAMP substrate by TR-FRET progressive binding assay
In DepthDetails ArticlePubMed
TargetDual 3',5'-cyclic-AMP and -GMP phosphodiesterase 11A(Homo sapiens (Human))
TBA
Curated by ChEMBL
LigandPNGBDBM98933(US8497265, 345)
Affinity DataIC50: >3.00E+4nM. Assay description: Inhibition of human PDE11A4 using FAM-cAMP substrate by TR-FRET progressive binding assay
In DepthDetails ArticlePubMed
LigandPNGBDBM98933(US8497265, 345)
Affinity DataIC50: >3.00E+4nM. Assay description: Inhibition of human PDE1B using FAM-cAMP substrate by TR-FRET progressive binding assay
In DepthDetails ArticlePubMed
LigandPNGBDBM98933(US8497265, 345)
Affinity DataIC50: >3.00E+4nM. Assay description: Inhibition of human PDE9A2 using FAM-cGMP substrate by TR-FRET progressive binding assay
In DepthDetails ArticlePubMed
TargetcGMP-inhibited 3',5'-cyclic phosphodiesterase 3A(Homo sapiens (Human))
TBA
Curated by ChEMBL
LigandPNGBDBM98933(US8497265, 345)
Affinity DataIC50: >3.00E+4nM. Assay description: Inhibition of human PDE3A using FAM-cAMP substrate by TR-FRET progressive binding assay
In DepthDetails ArticlePubMed
TargetcAMP-specific 3',5'-cyclic phosphodiesterase 4D(Homo sapiens (Human))
TBA
Curated by ChEMBL
LigandPNGBDBM98933(US8497265, 345)
Affinity DataIC50: >3.00E+4nM. Assay description: Inhibition of human PDE4D2 using FAM-cAMP substrate by TR-FRET progressive binding assay
In DepthDetails ArticlePubMed
TargetcGMP-specific 3',5'-cyclic phosphodiesterase(Homo sapiens (Human))
TBA
Curated by ChEMBL
LigandPNGBDBM98933(US8497265, 345)
Affinity DataIC50: >3.00E+4nM. Assay description: Inhibition of human PDE5A using FAM-cGMP substrate by TR-FRET progressive binding assay
In DepthDetails ArticlePubMed
LigandPNGBDBM98933(US8497265, 345)
Affinity DataIC50: >3.00E+4nM. Assay description: Inhibition of human PDE7A1 using FAM-cAMP substrate by TR-FRET progressive binding assay
In DepthDetails ArticlePubMed
LigandPNGBDBM98933(US8497265, 345)
Affinity DataIC50: >3.00E+4nM. Assay description: Inhibition of human PDE8A1 using FAM-cAMP substrate by TR-FRET progressive binding assay
In DepthDetails ArticlePubMed
TargetcGMP-dependent 3',5'-cyclic phosphodiesterase(Homo sapiens (Human))
TBA
Curated by ChEMBL
LigandPNGBDBM98933(US8497265, 345)
Affinity DataIC50: >3.00E+4nM. Assay description: Inhibition of human PDE2A1 using FAM-cAMP substrate by TR-FRET progressive binding assay
In DepthDetails ArticlePubMed