BDBM9894 2-(1H-Imidazol-1-yl)-3-(4-methoxyphenyl)-7-(benzyloxy)-4H-1-benzopyran-4-one::7-(benzyloxy)-2-(1H-imidazol-1-yl)-3-(4-methoxyphenyl)-4H-chromen-4-one::CHEMBL189274::azole isoflavone analog 2d
SMILES COc1ccc(cc1)-c1c(oc2cc(OCc3ccccc3)ccc2c1=O)-n1ccnc1
InChI Key InChIKey=QPTRWYFTUZRBMT-UHFFFAOYSA-N
Data  1 KI  2 IC50
  Tab Delimited (TSV)   2D SDfile   Computed 3D by Vconf -m prep SDfile
Find this compound or compounds like it in BindingDB:
Activity Spreadsheet -- Enzyme Inhibition Constant Data from BindingDB
Found 2 hits for monomerid = 9894
TargetAromatase(Homo sapiens (Human))
Ohio State University
LigandPNGBDBM9894(2-(1H-Imidazol-1-yl)-3-(4-methoxyphenyl)-7-(benzyl...)
Affinity DataKi:  4.40E+3nM ΔG°:  -7.60kcal/mole IC50:  4.70E+3nMpH: 7.0 T: 2°C. Assay description: Inhibition of human placental aromatase was determined by monitoring the amount of 3H2O released as the enzyme converts [1beta-3H]androst-4-ene-3,17-...
In DepthDetails ArticlePubMed
TargetAromatase(Homo sapiens (Human))
Ohio State University
LigandPNGBDBM9894(2-(1H-Imidazol-1-yl)-3-(4-methoxyphenyl)-7-(benzyl...)
Affinity DataIC50:  4.70E+3nM. Assay description: Inhibition of human aromatase-mediated conversion of [1beta3H]androstenedione to estrone by liquid scintillation counting in presence of NADPH
In DepthDetails ArticlePubMed