BDBM99348 US8497281, 59::US9120769, 59::US9663470, 59
SMILES Oc1cc(ccc1Cl)C(=O)N1CCCC2[C@@H]1CCc1ccccc21
InChI Key InChIKey=QKSGQFJURMZWEC-DAFXYXGESA-N
Data  3 IC50
  Tab Delimited (TSV)   2D SDfile   Computed 3D by Vconf -m prep SDfile
Find this compound or compounds like it in BindingDB:
Activity Spreadsheet -- Enzyme Inhibition Constant Data from BindingDB
Found 3 hits for monomerid = 99348
Target11-beta-hydroxysteroid dehydrogenase 1(Homo sapiens (Human))
Vitae Pharmaceuticals
US Patent
LigandPNGBDBM99348(US8497281, 59 | US9120769, 59 | US9663470, 59)
Affinity DataIC50:  2.10E+3nMpH: 6.0 T: 2°C. Assay description: In vitro inhibition of 11beta-HSD1 by test compounds is determined with HTRF (Homogeneous Time-Resolved Fluoresence) technology (cisbio international...
In DepthDetails US Patent
Target11-beta-hydroxysteroid dehydrogenase 1(Homo sapiens (Human))
Vitae Pharmaceuticals
US Patent
LigandPNGBDBM99348(US8497281, 59 | US9120769, 59 | US9663470, 59)
Affinity DataIC50:  2.10E+3nM. Assay description: In vitro inhibition of 11β-HSD1 by test compounds is determined with HTRF (Homogeneous Time-Resolved Fluorescence) technology (cisbio internatio...
In DepthDetails US Patent
Target11-beta-hydroxysteroid dehydrogenase 1(Homo sapiens (Human))
Vitae Pharmaceuticals
US Patent
LigandPNGBDBM99348(US8497281, 59 | US9120769, 59 | US9663470, 59)
Affinity DataIC50:  2.10E+3nMpH: 6.0Assay Description:n vitro inhibition of 11β-HSD1 by test compounds is determined with HTRF (Homogeneous Time-Resolved Fluorescence) technology (cisbio internation...
In DepthDetails US Patent