BDBM99453 US8497281, 231
SMILES O=C(N1CCC[C@H]2[C@@H]1Cc1ccc(cc21)C1CCOCC1)c1ccc2nc[nH]c2c1
InChI Key InChIKey=RGNUWCSONAQZKC-YKSBVNFPSA-N
Data  1 IC50
  Tab Delimited (TSV)   2D SDfile   Computed 3D by Vconf -m prep SDfile
Find this compound or compounds like it in BindingDB:
Activity Spreadsheet -- Enzyme Inhibition Constant Data from BindingDB
Found 1 hit for monomerid = 99453
Target11-beta-hydroxysteroid dehydrogenase 1(Homo sapiens (Human))
Vitae Pharmaceuticals
US Patent
LigandPNGBDBM99453(US8497281, 231)
Affinity DataIC50:  1.32E+3nMpH: 6.0 T: 2°C. Assay description: In vitro inhibition of 11beta-HSD1 by test compounds is determined with HTRF (Homogeneous Time-Resolved Fluoresence) technology (cisbio international...
In DepthDetails US Patent