BDBM99466 US8497281, 244
SMILES Cc1c2[C@@H]3CCCN([C@@H]3Cc2ccc1C#N)C(=O)c1ccc2nc[nH]c2c1
InChI Key InChIKey=GLINTZRCKYUHKH-YLJYHZDGSA-N
Data  1 IC50
  Tab Delimited (TSV)   2D SDfile   Computed 3D by Vconf -m prep SDfile
Find this compound or compounds like it in BindingDB:
Activity Spreadsheet -- Enzyme Inhibition Constant Data from BindingDB
Found 1 hit for monomerid = 99466
Target11-beta-hydroxysteroid dehydrogenase 1(Homo sapiens (Human))
Vitae Pharmaceuticals
US Patent
LigandPNGBDBM99466(US8497281, 244)
Affinity DataIC50: >100nMpH: 6.0 T: 2°C. Assay description: In vitro inhibition of 11beta-HSD1 by test compounds is determined with HTRF (Homogeneous Time-Resolved Fluoresence) technology (cisbio international...
In DepthDetails US Patent