BDBM99929 US8501729, 24
SMILES Cn1nc2CCN([C@@H]3CN4CCC3CC4)C(=O)c3cccc1c23
InChI Key InChIKey=GDMKKRJGHYVUND-MRXNPFEDSA-N
Data  1 KI
  Tab Delimited (TSV)   2D SDfile   Computed 3D by Vconf -m prep SDfile
Find this compound or compounds like it in BindingDB:
Activity Spreadsheet -- Enzyme Inhibition Constant Data from BindingDB
Found 1 hit for monomerid = 99929
Target5-hydroxytryptamine receptor 3A(Homo sapiens (Human))
Albany Molecular Research
US Patent
LigandPNGBDBM99929(US8501729, 24)
Affinity DataKi:  2nMpH: 7.5Assay Description:The relative affinity of the various compounds for the human 5-HT3 receptor was measured in a radioligand binding assay, using a scintillation proxim...
In DepthDetails US Patent