BDBM99961 US8501750, 131
SMILES CCc1cc2c(s1)n(Cc1ccc(cc1)-c1ccccc1-c1nc(=O)o[nH]1)c(=O)n(CC(=O)C(C)(C)C)c2=O
InChI Key InChIKey=WIVXJSUDXDCGAM-UHFFFAOYSA-N
Data  1 IC50
  Tab Delimited (TSV)   2D SDfile   Computed 3D by Vconf -m prep SDfile
Find this compound or compounds like it in BindingDB:
Activity Spreadsheet -- Enzyme Inhibition Constant Data from BindingDB
Found 1 hit for monomerid = 99961
TargetType-1 angiotensin II receptor(Homo sapiens (Human))
Takeda Pharmaceutical
US Patent
LigandPNGBDBM99961(US8501750, 131)
Affinity DataIC50:  1.20nM. Assay description: Binding assay using human AT1.
In DepthDetails US Patent