Target
Nociceptin receptor
Ligand
BDBM172399
Substrate
Meas. Tech.
In Vitro Delta-Opioid Receptor Binding Assay
Ki
182±25 nM
Citation
 Tanaka, NYamawaki, KYao, JYu, JZhou, X Substituted benzimidazole-type piperidine compounds and uses thereof US Patent  US9598411 Publication Date 3/21/2017 
Target
Name:
Nociceptin receptor
Synonyms:
KOR-3 Mu-type opioid receptor (Mu) Nociceptin Receptor (ORL1 Receptor) Nociceptin receptor (ORL-1) Nociceptin/Orphanin FQ, NOP receptor OPIATE ORL-1 OPRL1 protein ORL1 Opioid receptor like-1 Orphanin FQ receptor (ORL1) | P41146
Type:
G Protein-Coupled Receptor (GPCR)
Mol. Mass.:
40702.87
Organism:
Homo sapiens (Human)
Description:
P41146
Residue:
370
  
Inhibitor
Name:
BDBM172399
Synonyms:
US9090618, ZA11 | US9598411, Ref. No. ZA11
Type:
Small organic molecule
Emp. Form.:
C36H56N4O3
Mol. Mass.:
592.8548
SMILES:
COCCOCCOCCN1CCC[C@H](C1)c1nc2ccccc2n1[C@@H]1C[C@@H]2CCC[C@H](C1)N2[C@@H]1C[C@H]2CCC[C@H](C2)C1
: