Target
Nociceptin receptor
Ligand
BDBM172401
Substrate
Meas. Tech.
In Vitro Delta-Opioid Receptor Binding Assay
Ki
505±29 nM
Citation
 Tanaka, NYamawaki, KYao, JYu, JZhou, X Substituted benzimidazole-type piperidine compounds and uses thereof US Patent  US9598411 Publication Date 3/21/2017 
Target
Name:
Nociceptin receptor
Synonyms:
KOR-3 Mu-type opioid receptor (Mu) Nociceptin Receptor (ORL1 Receptor) Nociceptin receptor (ORL-1) Nociceptin/Orphanin FQ, NOP receptor OPIATE ORL-1 OPRL1 protein ORL1 Opioid receptor like-1 Orphanin FQ receptor (ORL1) | P41146
Type:
G Protein-Coupled Receptor (GPCR)
Mol. Mass.:
40702.87
Organism:
Homo sapiens (Human)
Description:
P41146
Residue:
370
  
Inhibitor
Name:
BDBM172401
Synonyms:
US9090618, ZA14 | US9598411, Ref. No. ZA14
Type:
Small organic molecule
Emp. Form.:
C30H42N4O2
Mol. Mass.:
490.6801
SMILES:
C[C@H]1C[C@H]2C[C@@H](C1)C[C@@H](C2)N1[C@H]2CCC[C@@H]1C[C@@H](C2)n1c(nc2ccccc12)N1CCC[C@H]1C(O)=O
: