Target
Kappa-type opioid receptor
Ligand
BDBM172413
Substrate
Meas. Tech.
In Vitro Mu-Opioid Receptor Binding Assay
Ki
246±77 nM
Citation
 Tanaka, NYamawaki, KYao, JYu, JZhou, X Substituted benzimidazole-type piperidine compounds and uses thereof US Patent  US9598411 Publication Date 3/21/2017 
Target
Name:
Kappa-type opioid receptor
Synonyms:
K-OR-1 Kappa-opioid receptor (KOR) Kappa-type opioid receptor (KOR) OPIATE Kappa OPRK1 kappa opioid receptor (KOR)
Type:
G Protein-Coupled Receptor (GPCR)
Mol. Mass.:
42648.76
Organism:
Homo sapiens (Human)
Description:
P41145
Residue:
380
  
Inhibitor
Name:
BDBM172413
Synonyms:
US9090618, ZA35 | US9598411, Ref. No. ZA35
Type:
Small organic molecule
Emp. Form.:
C25H35N3O
Mol. Mass.:
393.5649
SMILES:
OCc1nc2ccccc2n1C1C[C@@H]2CCC[C@H](C1)N2[C@@H]1C[C@H]2CCC[C@H](C2)C1
: