Target
Mu-type opioid receptor
Ligand
BDBM172432
Substrate
Meas. Tech.
In Vitro Kappa-Opioid Receptor Binding Assay
Ki
1914±292 nM
Citation
 Tanaka, NYamawaki, KYao, JYu, JZhou, X Substituted benzimidazole-type piperidine compounds and uses thereof US Patent  US9598411 Publication Date 3/21/2017 
Target
Name:
Mu-type opioid receptor
Synonyms:
M-OR-1 MOR-1 MUOR1 Mu opiate receptor OPRM1 hMOP | mu-type opioid receptor isoform MOR-1
Type:
G Protein-Coupled Receptor (GPCR)
Mol. Mass.:
44789.51
Organism:
Homo sapiens (Human)
Description:
P35372
Residue:
400
  
Inhibitor
Name:
BDBM172432
Synonyms:
US9090618, ZA55 | US9598411, Ref. No. ZA55
Type:
Small organic molecule
Emp. Form.:
C30H44N4O
Mol. Mass.:
476.6966
SMILES:
C([C@H]1COCCN1)c1nc2ccccc2n1[C@@H]1C[C@@H]2CCC[C@H](C1)N2[C@H]1C[C@@H]2C[C@H](C1)CCCC2
: