Target
Delta-type opioid receptor
Ligand
BDBM172432
Substrate
Meas. Tech.
In Vitro ORL-1 Receptor Binding Assay
Ki
20000±n/a nM
Citation
 Tanaka, NYamawaki, KYao, JYu, JZhou, X Substituted benzimidazole-type piperidine compounds and uses thereof US Patent  US9598411 Publication Date 3/21/2017 
Target
Name:
Delta-type opioid receptor
Synonyms:
D-OR-1 Delta opioid receptor OPIATE Delta OPRD1 OPRK1 | opioid receptor, delta 1
Type:
G Protein-Coupled Receptor (GPCR)
Mol. Mass.:
40382.98
Organism:
Homo sapiens (Human)
Description:
Competition binding assays were carried out using membrane preparations from transfected HN9.10 cells that constitutively expressed the delta opioid receptor.
Residue:
372
  
Inhibitor
Name:
BDBM172432
Synonyms:
US9090618, ZA55 | US9598411, Ref. No. ZA55
Type:
Small organic molecule
Emp. Form.:
C30H44N4O
Mol. Mass.:
476.6966
SMILES:
C([C@H]1COCCN1)c1nc2ccccc2n1[C@@H]1C[C@@H]2CCC[C@H](C1)N2[C@H]1C[C@@H]2C[C@H](C1)CCCC2
: