Target
Nociceptin receptor
Ligand
BDBM172434
Substrate
Meas. Tech.
In Vitro Delta-Opioid Receptor Binding Assay
Ki
8.50±1.1 nM
Citation
 Tanaka, NYamawaki, KYao, JYu, JZhou, X Substituted benzimidazole-type piperidine compounds and uses thereof US Patent  US9598411 Publication Date 3/21/2017 
Target
Name:
Nociceptin receptor
Synonyms:
KOR-3 Mu-type opioid receptor (Mu) Nociceptin Receptor (ORL1 Receptor) Nociceptin receptor (ORL-1) Nociceptin/Orphanin FQ, NOP receptor OPIATE ORL-1 OPRL1 protein ORL1 Opioid receptor like-1 Orphanin FQ receptor (ORL1) | P41146
Type:
G Protein-Coupled Receptor (GPCR)
Mol. Mass.:
40702.87
Organism:
Homo sapiens (Human)
Description:
P41146
Residue:
370
  
Inhibitor
Name:
BDBM172434
Synonyms:
US9090618, ZA57 | US9598411, Ref. No. ZA57
Type:
Small organic molecule
Emp. Form.:
C35H50N6O
Mol. Mass.:
570.8111
SMILES:
Cn1ccnc1CN1CCOC[C@H]1Cc1nc2ccccc2n1[C@@H]1C[C@@H]2CCC[C@H](C1)N2[C@H]1C[C@@H]2C[C@H](C1)CCCC2
: