Target
Nociceptin receptor
Ligand
BDBM172438
Substrate
Meas. Tech.
In Vitro Delta-Opioid Receptor Binding Assay
Ki
3.80±0.7 nM
Citation
 Tanaka, NYamawaki, KYao, JYu, JZhou, X Substituted benzimidazole-type piperidine compounds and uses thereof US Patent  US9598411 Publication Date 3/21/2017 
Target
Name:
Nociceptin receptor
Synonyms:
KOR-3 Mu-type opioid receptor (Mu) Nociceptin Receptor (ORL1 Receptor) Nociceptin receptor (ORL-1) Nociceptin/Orphanin FQ, NOP receptor OPIATE ORL-1 OPRL1 protein ORL1 Opioid receptor like-1 Orphanin FQ receptor (ORL1) | P41146
Type:
G Protein-Coupled Receptor (GPCR)
Mol. Mass.:
40702.87
Organism:
Homo sapiens (Human)
Description:
P41146
Residue:
370
  
Inhibitor
Name:
BDBM172438
Synonyms:
US9090618, ZA61 | US9598411, Ref. No. ZA61
Type:
Small organic molecule
Emp. Form.:
C29H40N6
Mol. Mass.:
472.6681
SMILES:
Cc1nnc(Cc2nc3ccccc3n2[C@@H]2C[C@@H]3CCC[C@H](C2)N3[C@H]2C[C@@H]3C[C@H](C2)CCCC3)[nH]1
: