Target
Vascular endothelial growth factor receptor 2
Ligand
BDBM507109
Substrate
Meas. Tech.
VEGFR2 Enzyme Inhibition
Ki
3.86±n/a nM
Citation
 Walters, IBirch, LHill-Cousins, JCollingwood, SPStevenson, CS Indolinones compounds and their use in the treatment of fibrotic diseases US Patent  US11046672 Publication Date 6/29/2021 
Target
Name:
Vascular endothelial growth factor receptor 2
Synonyms:
CD_antigen=CD309 Fetal liver kinase 1 (FLK-1) KDR Protein-tyrosine kinase receptor Flk-1 VEGFR-2 VEGFR2 Vascular Endothelial Growth Factor Receptor Kinase 2 Vascular endothelial growth factor receptor 2 (KDR) Vascular endothelial growth factor receptor 2 (VEGFR2) Vascular endothelial growth factor receptor-2 (VEGFR-2)
Type:
Receptor Tyrosine Kinase
Mol. Mass.:
151510.97
Organism:
Homo sapiens (Human)
Description:
P35968
Residue:
1356
  
Inhibitor
Name:
BDBM507109
Synonyms:
US11046672, Example 58
Type:
Small organic molecule
Emp. Form.:
C34H39N5O6
Mol. Mass.:
613.7034
SMILES:
COC(=O)c1cc2NC(=O)\C(=C(/Nc3ccc(cc3)C(=O)N(C)OCCN3CCN(CCO)CC3)c3ccccc3)c2cc1C
: