Target
Nuclear receptor ROR-gamma
Ligand
BDBM302211
Substrate
Meas. Tech.
Reporter Gene Assay
IC50
135±n/a nM
Citation
 Bakonyi, JBrunette, SRCollin, DHughes, ROLi, XLiang, SSibley, RTurner, MRWu, LZhang, Q Compounds as modulators of RORγ US Patent  US9598415 Publication Date 3/21/2017 
Target
Name:
Nuclear receptor ROR-gamma
Synonyms:
NR1F3 Nuclear receptor ROR-gamma (RORC) RAR-related orphan receptor C (RORc) RORG RZRG Retinoid-related orphan receptor-gamma (RORc)
Type:
Enzyme Catalytic Domain
Mol. Mass.:
58218.40
Organism:
Homo sapiens (Human)
Description:
P51449
Residue:
518
  
Inhibitor
Name:
BDBM302211
Synonyms:
US9598415, 123
Type:
Small organic molecule
Emp. Form.:
C26H28N8O4S
Mol. Mass.:
548.617
SMILES:
COc1ncnc(C2CC2)c1-c1ncc2nc(NCc3ccc(nc3)S(C)(=O)=O)c(=O)n([C@@H](C)C3CC3)c2n1
: