Target
Nuclear receptor ROR-gamma
Ligand
BDBM302312
Substrate
Meas. Tech.
Reporter Gene Assay
IC50
120±n/a nM
Citation
 Bakonyi, JBrunette, SRCollin, DHughes, ROLi, XLiang, SSibley, RTurner, MRWu, LZhang, Q Compounds as modulators of RORγ US Patent  US9598415 Publication Date 3/21/2017 
Target
Name:
Nuclear receptor ROR-gamma
Synonyms:
NR1F3 Nuclear receptor ROR-gamma (RORC) RAR-related orphan receptor C (RORc) RORG RZRG Retinoid-related orphan receptor-gamma (RORc)
Type:
Enzyme Catalytic Domain
Mol. Mass.:
58218.40
Organism:
Homo sapiens (Human)
Description:
P51449
Residue:
518
  
Inhibitor
Name:
BDBM302312
Synonyms:
US9598415, 224
Type:
Small organic molecule
Emp. Form.:
C28H32N8O3S
Mol. Mass.:
560.67
SMILES:
CC[C@@H](C)n1c2nc(ncc2nc(NCc2ccc(nc2)S(=O)(=O)CC)c1=O)-c1c(ncnc1C1CC1)C1CC1
: