Target
Fibroblast growth factor receptor 3
Ligand
BDBM302377
Substrate
IC50
17.4±n/a nM
Citation
 Collin, MBrohm, DHéroult, MLobell, MHübsch, WLustig, KGrünewald, SBömer, UVöhringer, VLindner, N Substituted benzothienyl-pyrrolotriazines and uses thereof in the treatment cancer US Patent  US9598416 Publication Date 3/21/2017 
Target
Name:
Fibroblast growth factor receptor 3
Synonyms:
CD_antigen: CD333 FGFR3 Fibroblast growth factor receptor JTK4
Type:
Protein
Mol. Mass.:
87699.57
Organism:
Homo sapiens (Human)
Description:
P22607
Residue:
806
  
Inhibitor
Name:
BDBM302377
Synonyms:
5-(7-Methoxy-5-methyl-1-benzothiophen-2-yl)-6-(morpholin-4-ylmethyl)pyrrolo[2,1-f][1,2,4]triazin-4-amine | US9598416, Example 23
Type:
Small organic molecule
Emp. Form.:
C21H23N5O2S
Mol. Mass.:
409.505
SMILES:
COc1cc(C)cc2cc(sc12)-c1c(CN2CCOCC2)cn2ncnc(N)c12
: