Target
Fibroblast growth factor receptor 3
Ligand
BDBM255742
Substrate
IC50
506±n/a nM
Citation
 Collin, MBrohm, DHéroult, MLobell, MHübsch, WLustig, KGrünewald, SBömer, UVöhringer, VLindner, N Substituted benzothienyl-pyrrolotriazines and uses thereof in the treatment cancer US Patent  US9598416 Publication Date 3/21/2017 
Target
Name:
Fibroblast growth factor receptor 3
Synonyms:
CD_antigen: CD333 FGFR3 Fibroblast growth factor receptor JTK4
Type:
Protein
Mol. Mass.:
87699.57
Organism:
Homo sapiens (Human)
Description:
P22607
Residue:
806
  
Inhibitor
Name:
BDBM255742
Synonyms:
US9475815, WO 2007/61737: 120 | US9598416, Example 120 W 2007/061737
Type:
Small organic molecule
Emp. Form.:
C18H16N4S
Mol. Mass.:
320.411
SMILES:
Nc1nccn2c(nc(-c3cc4ccccc4s3)c12)C1CCC1
: