Target
Plasmepsin II
Ligand
BDBM8006
Substrate
Peptide Substrate
Meas. Tech.
Enzyme Inhibition Measurements
pH
4.5±n/a
Temperature
295.15±n/a K
Ki
13±n/a nM
Citation
 Ersmark, KFeierberg, IBjelic, SHamelink, EHackett, FBlackman, MJHulten, JSamuelsson, BAqvist, JHallberg, A Potent inhibitors of the Plasmodium falciparum enzymes plasmepsin I and II devoid of cathepsin D inhibitory activity. J Med Chem 47:110-22 (2004)  
Target
Name:
Plasmepsin II
Synonyms:
Aspartic hemoglobinase II PLM2_PLAFX Plasmepsin 2 Plasmepsin-II
Type:
Enzyme
Mol. Mass.:
51482.09
Organism:
Plasmodium falciparum
Description:
P46925
Residue:
453
  
Inhibitor
Name:
BDBM8006
Synonyms:
(2R,3R,4R,5R)-2,5-bis({[(2E)-3-(2,4-dimethoxypyrimidin-5-yl)prop-2-en-1-yl]oxy})-3,4-dihydroxy-N,N'-bis[(1S,2R)-2-hydroxy-2,3-dihydro-1H-inden-1-yl]hexanediamide C2-symmetric compound 14
Type:
Small organic molecule
Emp. Form.:
C42H48N6O12
Mol. Mass.:
828.8635
SMILES:
COc1ncc(\C=C\CO[C@H]([C@H](O)[C@@H](O)[C@@H](OC\C=C\c2cnc(OC)nc2OC)C(=O)N[C@@H]2[C@H](O)Cc3ccccc23)C(=O)N[C@@H]2[C@H](O)Cc3ccccc23)c(OC)n1
:
Substrate
Name:
Peptide Substrate
Synonyms:
Type:
Peptide
Mol. Mass.:
3501.67
Organism:
Description:
Residue:
31